{"text_format":"1","workbook":"xlsx","n_sheets":5,"sheets":["Vista Calendario","Seguimiento de bajas del emp...","Lista de empleados","Tipos de baja","Días festivos de la empresa"],"not_rendered":{"charts":0,"images":0,"macros":0,"external_links":1,"defined_names":16,"comments":0,"pivot_tables":0},"unopened":[],"bounds":{"document_bytes":16777216,"sheet_cells":100000,"rows_first":2000,"rows_last":500,"rows_between":2000,"halvings":0,"cell_chars":16384,"cell_head_chars":4096},"cells_cut":0,"cells_raw":0,"read":"whole","date_system":"1900"}

{"sheet":"Vista Calendario","index":0,"n_rows":22,"n_cols":44,"rows_kept":22,"cut":false,"hidden":false,"merged":[[1,2,1,8],[2,2,2,8],[19,20,19,23],[20,20,20,23],[21,20,21,23],[18,20,18,23],[21,2,21,5],[18,14,18,17],[19,14,19,17],[19,8,19,11],[21,8,21,11],[20,14,20,17],[21,14,21,17],[18,8,18,11],[20,8,20,11],[20,2,20,5],[19,2,19,5],[18,2,18,5],[20,26,20,29],[21,26,21,29],[19,32,19,35],[20,32,20,35],[18,32,18,35],[21,32,21,35],[19,26,19,29],[18,26,18,29]]}
[null,"REGISTRO DE ASISTENCIA DE EMPLEADO"]
[null,"Seleccione a un empleado:","Empleado 1"]
[null,"Escriba el año:",{"$f":"YEAR(TODAY())","v":2017}]
[]
[null,"Día de la semana o mes","DO","LU","MA","MI","JU","VI","SÁ","DO   ","LU      2","MA ","MI   ","JU ","VI   ","SÁ  ","DO   2","LU       2","MA    ","MI  ","JU      2","VI       2","SÁ    ","DO     ","LU ","MA     ","MI     ","JU       3","VI  ","SÁ    2","DO     2","LU     3","MA     2","MI ","JU      22","VIE ","SÁ        2","DO  ","LU      22","MA    2","MI     2","JU       2","VI         2","SÁ      2"]
[null,"Enero",{"$f":"IFERROR(IF(TEXT(DATE(Calendar_Year,ROW($A1),1),\"ddd\")=LEFT(C$5,2),DATE(Calendar_Year,ROW($A1),1),\"\"),\"\")","v":"2017-01-01"},{"$f":"IFERROR(IF(TEXT(DATE(Calendar_Year,ROW($A1),1),\"ddd\")=LEFT(D$5,2),DATE(Calendar_Year,ROW($A1),1),IF(C6>=1,C6+1,\"\")),\"\")","v":"2017-01-02"},"2017-01-03","2017-01-04","2017-01-05","2017-01-06","2017-01-07",{"$f":"IFERROR(IF(I6>=1,I6+1,\"\"),\"\")","v":"2017-01-08"},{"$f":"IFERROR(IF(J6>=1,J6+1,\"\"),\"\")","v":"2017-01-09"},{"$f":"IFERROR(IF(K6>=1,K6+1,\"\"),\"\")","v":"2017-01-10"},{"$f":"IFERROR(IF(L6>=1,L6+1,\"\"),\"\")","v":"2017-01-11"},{"$f":"IFERROR(IF(M6>=1,M6+1,\"\"),\"\")","v":"2017-01-12"},{"$f":"IFERROR(IF(N6>=1,N6+1,\"\"),\"\")","v":"2017-01-13"},{"$f":"IFERROR(IF(O6>=1,O6+1,\"\"),\"\")","v":"2017-01-14"},{"$f":"IFERROR(IF(P6>=1,P6+1,\"\"),\"\")","v":"2017-01-15"},{"$f":"IFERROR(IF(Q6>=1,Q6+1,\"\"),\"\")","v":"2017-01-16"},{"$f":"IFERROR(IF(R6>=1,R6+1,\"\"),\"\")","v":"2017-01-17"},{"$f":"IFERROR(IF(S6>=1,S6+1,\"\"),\"\")","v":"2017-01-18"},{"$f":"IFERROR(IF(T6>=1,T6+1,\"\"),\"\")","v":"2017-01-19"},{"$f":"IFERROR(IF(U6>=1,U6+1,\"\"),\"\")","v":"2017-01-20"},{"$f":"IFERROR(IF(V6>=1,V6+1,\"\"),\"\")","v":"2017-01-21"},{"$f":"IFERROR(IF(W6>=1,W6+1,\"\"),\"\")","v":"2017-01-22"},{"$f":"IFERROR(IF(X6>=1,X6+1,\"\"),\"\")","v":"2017-01-23"},{"$f":"IFERROR(IF(Y6>=1,Y6+1,\"\"),\"\")","v":"2017-01-24"},{"$f":"IFERROR(IF(Z6>=1,Z6+1,\"\"),\"\")","v":"2017-01-25"},{"$f":"IFERROR(IF(AA6>=1,AA6+1,\"\"),\"\")","v":"2017-01-26"},{"$f":"IFERROR(IF(AB6>=1,AB6+1,\"\"),\"\")","v":"2017-01-27"},{"$f":"IFERROR(IF(AC6>=1,AC6+1,\"\"),\"\")","v":"2017-01-28"},{"$f":"IFERROR(IF(AD6>=1,AD6+1,\"\"),\"\")","v":"2017-01-29"},{"$f":"IFERROR(IF(AE6>=1,AE6+1,\"\"),\"\")","v":"2017-01-30"},{"$f":"IFERROR(IF(AF6>=1,AF6+1,\"\"),\"\")","v":"2017-01-31"},{"$f":"IFERROR(IF(AG6>=1,AG6+1,\"\"),\"\")","v":"2017-02-01"},{"$f":"IFERROR(IF(AH6>=1,AH6+1,\"\"),\"\")","v":"2017-02-02"},{"$f":"IFERROR(IF(AI6>=1,AI6+1,\"\"),\"\")","v":"2017-02-03"},{"$f":"IFERROR(IF(AJ6>=1,AJ6+1,\"\"),\"\")","v":"2017-02-04"},{"$f":"IFERROR(IF(AND(AK6>=1,AK6+1<=DATE(Calendar_Year,ROW($A1)+1,0)),AK6+1,\"\"),\"\")","v":""},"","","","","",""]
[null,"Febrero","","","","2017-02-01","2017-02-02","2017-02-03","2017-02-04","2017-02-05","2017-02-06","2017-02-07","2017-02-08","2017-02-09","2017-02-10","2017-02-11","2017-02-12","2017-02-13","2017-02-14","2017-02-15","2017-02-16","2017-02-17","2017-02-18","2017-02-19","2017-02-20","2017-02-21","2017-02-22","2017-02-23","2017-02-24","2017-02-25","2017-02-26","2017-02-27","2017-02-28","2017-03-01","2017-03-02","2017-03-03","2017-03-04","","","","","","",""]
[null,"Marzo","","","","2017-03-01","2017-03-02","2017-03-03","2017-03-04","2017-03-05","2017-03-06","2017-03-07","2017-03-08","2017-03-09","2017-03-10","2017-03-11","2017-03-12","2017-03-13","2017-03-14","2017-03-15","2017-03-16","2017-03-17","2017-03-18","2017-03-19","2017-03-20","2017-03-21","2017-03-22","2017-03-23","2017-03-24","2017-03-25","2017-03-26","2017-03-27","2017-03-28","2017-03-29","2017-03-30","2017-03-31","2017-04-01","","","","","","",""]
[null,"Abril","","","","","","","2017-04-01","2017-04-02","2017-04-03","2017-04-04","2017-04-05","2017-04-06","2017-04-07","2017-04-08","2017-04-09","2017-04-10","2017-04-11","2017-04-12","2017-04-13","2017-04-14","2017-04-15","2017-04-16","2017-04-17","2017-04-18","2017-04-19","2017-04-20","2017-04-21","2017-04-22","2017-04-23","2017-04-24","2017-04-25","2017-04-26","2017-04-27","2017-04-28","2017-04-29","2017-04-30","","","","","",""]
[null,"Mayo","","2017-05-01","2017-05-02","2017-05-03","2017-05-04","2017-05-05","2017-05-06","2017-05-07","2017-05-08","2017-05-09","2017-05-10","2017-05-11","2017-05-12","2017-05-13","2017-05-14","2017-05-15","2017-05-16","2017-05-17","2017-05-18","2017-05-19","2017-05-20","2017-05-21","2017-05-22","2017-05-23","2017-05-24","2017-05-25","2017-05-26","2017-05-27","2017-05-28","2017-05-29","2017-05-30","2017-05-31","2017-06-01","2017-06-02","2017-06-03","","","","","","",""]
[null,"Junio","","","","","2017-06-01","2017-06-02","2017-06-03","2017-06-04","2017-06-05","2017-06-06","2017-06-07","2017-06-08","2017-06-09","2017-06-10","2017-06-11","2017-06-12","2017-06-13","2017-06-14","2017-06-15","2017-06-16","2017-06-17","2017-06-18","2017-06-19","2017-06-20","2017-06-21","2017-06-22","2017-06-23","2017-06-24","2017-06-25","2017-06-26","2017-06-27","2017-06-28","2017-06-29","2017-06-30","2017-07-01","","","","","","",""]
[null,"Julio","","","","","","","2017-07-01","2017-07-02","2017-07-03","2017-07-04","2017-07-05","2017-07-06","2017-07-07","2017-07-08","2017-07-09","2017-07-10","2017-07-11","2017-07-12","2017-07-13","2017-07-14","2017-07-15","2017-07-16","2017-07-17","2017-07-18","2017-07-19","2017-07-20","2017-07-21","2017-07-22","2017-07-23","2017-07-24","2017-07-25","2017-07-26","2017-07-27","2017-07-28","2017-07-29","2017-07-30","2017-07-31","","","","",""]
[null,"Agosto","","","2017-08-01","2017-08-02","2017-08-03","2017-08-04","2017-08-05","2017-08-06","2017-08-07","2017-08-08","2017-08-09","2017-08-10","2017-08-11","2017-08-12","2017-08-13","2017-08-14","2017-08-15","2017-08-16","2017-08-17","2017-08-18","2017-08-19","2017-08-20","2017-08-21","2017-08-22","2017-08-23","2017-08-24","2017-08-25","2017-08-26","2017-08-27","2017-08-28","2017-08-29","2017-08-30","2017-08-31","2017-09-01","2017-09-02","","","","","","",""]
[null,"Septiembre","","","","","","2017-09-01","2017-09-02","2017-09-03","2017-09-04","2017-09-05","2017-09-06","2017-09-07","2017-09-08","2017-09-09","2017-09-10","2017-09-11","2017-09-12","2017-09-13","2017-09-14","2017-09-15","2017-09-16","2017-09-17","2017-09-18","2017-09-19","2017-09-20","2017-09-21","2017-09-22","2017-09-23","2017-09-24","2017-09-25","2017-09-26","2017-09-27","2017-09-28","2017-09-29","2017-09-30","","","","","","",""]
[null,"Octubre","2017-10-01","2017-10-02","2017-10-03","2017-10-04","2017-10-05","2017-10-06","2017-10-07","2017-10-08","2017-10-09","2017-10-10","2017-10-11","2017-10-12","2017-10-13","2017-10-14","2017-10-15","2017-10-16","2017-10-17","2017-10-18","2017-10-19","2017-10-20","2017-10-21","2017-10-22","2017-10-23","2017-10-24","2017-10-25","2017-10-26","2017-10-27","2017-10-28","2017-10-29","2017-10-30","2017-10-31","2017-11-01","2017-11-02","2017-11-03","2017-11-04","","","","","","",""]
[null,"Noviembre","","","","2017-11-01","2017-11-02","2017-11-03","2017-11-04","2017-11-05","2017-11-06","2017-11-07","2017-11-08","2017-11-09","2017-11-10","2017-11-11","2017-11-12","2017-11-13","2017-11-14","2017-11-15","2017-11-16","2017-11-17","2017-11-18","2017-11-19","2017-11-20","2017-11-21","2017-11-22","2017-11-23","2017-11-24","2017-11-25","2017-11-26","2017-11-27","2017-11-28","2017-11-29","2017-11-30","2017-12-01","2017-12-02","","","","","","",""]
[null,"Diciembre","","","","","","2017-12-01","2017-12-02","2017-12-03","2017-12-04","2017-12-05","2017-12-06","2017-12-07","2017-12-08","2017-12-09","2017-12-10","2017-12-11","2017-12-12","2017-12-13","2017-12-14","2017-12-15","2017-12-16","2017-12-17","2017-12-18","2017-12-19","2017-12-20","2017-12-21","2017-12-22","2017-12-23","2017-12-24","2017-12-25","2017-12-26","2017-12-27","2017-12-28","2017-12-29","2017-12-30","2017-12-31","","","","","",""]
[null,"ESTADÍSTICAS CLAVE"]
[null,null,"Días de baja",null,null,null,null,null,"Días laborables",null,null,null,null,null,"N.º de días de baja",null,null,null,null,null,"Vacaciones",null,null,null,null,null,"Permiso por defunción",null,null,null,null,null,"Otros"]
[null,null,{"$f":"SUMIFS(LeaveTracker[Días],LeaveTracker[Nombre del empleado],valSelEmployee,LeaveTracker[Fecha de inicio],\">=\"&DATE(Calendar_Year,1,1),LeaveTracker[Fecha de finalización],\"<\"&DATE(Calendar_Year+1,1,1))","v":4},null,null,null,null,null,{"$f":"NETWORKDAYS(DATE(Calendar_Year,1,1),EDATE(DATE(Calendar_Year,1,1),12)-1)","v":260},null,null,null,null,null,{"$f":"SUMIFS(LeaveTracker[Días],LeaveTracker[Nombre del empleado],valSelEmployee,LeaveTracker[Fecha de inicio],\">=\"&DATE(Calendar_Year,1,1),LeaveTracker[Fecha de finalización],\"<\"&DATE(Calendar_Year+1,1,1),LeaveTracker[Tipo de baja],'Tipos de baja'!B4)","v":1},null,null,null,null,null,{"$f":"SUMIFS(LeaveTracker[Días],LeaveTracker[Nombre del empleado],valSelEmployee,LeaveTracker[Fecha de inicio],\">=\"&DATE(Calendar_Year,1,1),LeaveTracker[Fecha de finalización],\"<\"&DATE(Calendar_Year+1,1,1),LeaveTracker[Tipo de baja],'Tipos de baja'!B5)","v":0},null,null,null,null,null,{"$f":"SUMIFS(LeaveTracker[Días],LeaveTracker[Nombre del empleado],valSelEmployee,LeaveTracker[Fecha de inicio],\">=\"&DATE(Calendar_Year,1,1),LeaveTracker[Fecha de finalización],\"<\"&DATE(Calendar_Year+1,1,1),LeaveTracker[Tipo de baja],'Tipos de baja'!B6)","v":3},null,null,null,null,null,{"$f":"SUMIFS(LeaveTracker[Días],LeaveTracker[Nombre del empleado],valSelEmployee,LeaveTracker[Fecha de inicio],\">=\"&DATE(Calendar_Year,1,1),LeaveTracker[Fecha de finalización],\"<\"&DATE(Calendar_Year+1,1,1),LeaveTracker[Tipo de baja],'Tipos de baja'!B7)","v":0}]
[null,null,{"$f":"SUMIFS(LeaveTracker[Días],LeaveTracker[Nombre del empleado],valSelEmployee,LeaveTracker[Fecha de inicio],\">=\"&DATE(Calendar_Year-1,1,1),LeaveTracker[Fecha de finalización],\"<\"&DATE(Calendar_Year,1,1))","v":14},null,null,null,null,null,{"$f":"NETWORKDAYS(DATE(Calendar_Year-1,1,1),EDATE(DATE(Calendar_Year-1,1,1),12)-1)","v":261},null,null,null,null,null,{"$f":"SUMIFS(LeaveTracker[Días],LeaveTracker[Nombre del empleado],valSelEmployee,LeaveTracker[Fecha de inicio],\">=\"&DATE(Calendar_Year-1,1,1),LeaveTracker[Fecha de finalización],\"<\"&DATE(Calendar_Year,1,1),LeaveTracker[Tipo de baja],'Tipos de baja'!B4)","v":4},null,null,null,null,null,{"$f":"SUMIFS(LeaveTracker[Días],LeaveTracker[Nombre del empleado],valSelEmployee,LeaveTracker[Fecha de inicio],\">=\"&DATE(Calendar_Year-1,1,1),LeaveTracker[Fecha de finalización],\"<\"&DATE(Calendar_Year,1,1),LeaveTracker[Tipo de baja],'Tipos de baja'!B5)","v":8},null,null,null,null,null,{"$f":"SUMIFS(LeaveTracker[Días],LeaveTracker[Nombre del empleado],valSelEmployee,LeaveTracker[Fecha de inicio],\">=\"&DATE(Calendar_Year-1,1,1),LeaveTracker[Fecha de finalización],\"<\"&DATE(Calendar_Year,1,1),LeaveTracker[Tipo de baja],'Tipos de baja'!B6)","v":0},null,null,null,null,null,{"$f":"SUMIFS(LeaveTracker[Días],LeaveTracker[Nombre del empleado],valSelEmployee,LeaveTracker[Fecha de inicio],\">=\"&DATE(Calendar_Year-1,1,1),LeaveTracker[Fecha de finalización],\"<\"&DATE(Calendar_Year,1,1),LeaveTracker[Tipo de baja],'Tipos de baja'!B7)","v":2}]
[null,null,{"$f":"IFERROR(IF(C21<>0,IF(C20>=C21,\"UP \", \"DESCENSO DEL \")&TEXT(C20/C21-1,\"0%;0%\"),\"AUMENTO DEL 100%\"),\"\")","v":"DESCENSO DEL 71%"},null,null,null,null,null,{"$f":"IFERROR(IF(I21<>0,IF(I20>=I21,\"UP \", \"DESCENSO DEL \")&TEXT(I20/I21-1,\"0%;0%\"),\"AUMENTO DEL 100%\"),\"\")","v":"DESCENSO DEL 0%"},null,null,null,null,null,{"$f":"IFERROR(IF(O21<>0,IF(O20>=O21,\"UP \", \"DESCENSO DEL \")&TEXT(O20/O21-1,\"0%;0%\"),\"AUMENTO DEL 100%\"),\"\")","v":"DESCENSO DEL 75%"},null,null,null,null,null,{"$f":"IFERROR(IF(U21<>0,IF(U20>=U21,\"UP \", \"DESCENSO DEL \")&TEXT(U20/U21-1,\"0%;0%\"),\"AUMENTO DEL 100%\"),\"\")","v":"DESCENSO DEL 100%"},null,null,null,null,null,{"$f":"IFERROR(IF(AA21<>0,IF(AA20>=AA21,\"UP \", \"DESCENSO DEL \")&TEXT(AA20/AA21-1,\"0%;0%\"),\"AUMENTO DEL 100%\"),\"\")","v":"AUMENTO DEL 100%"},null,null,null,null,null,{"$f":"IFERROR(IF(AG21<>0,IF(AG20>=AG21,\"UP \", \"DESCENSO DEL \")&TEXT(AG20/AG21-1,\"0%;0%\"),\"AUMENTO DEL 100%\"),\"\")","v":"DESCENSO DEL 100%"}]

{"sheet":"Seguimiento de bajas del emp...","index":1,"n_rows":26,"n_cols":6,"rows_kept":26,"cut":false,"hidden":false,"merged":[]}
[null,"Seguimiento de bajas del empleado"]
[]
[null,"Nombre del empleado","Fecha de inicio","Fecha de finalización","Tipo de baja","Días"]
[null,"Empleado 1",{"$f":"DATE(YEAR(TODAY()),1,3)","v":"2017-01-03"},{"$f":"DATE(YEAR(TODAY()),1,3)","v":"2017-01-03"},"Baja por enfermedad",{"$f":"NETWORKDAYS(LeaveTracker[[#This Row],[Fecha de inicio]],LeaveTracker[[#This Row],[Fecha de finalización]],lstHolidays)","v":1}]
[null,"Empleado 2",{"$f":"DATE(YEAR(TODAY()),1,17)","v":"2017-01-17"},{"$f":"DATE(YEAR(TODAY()),1,18)","v":"2017-01-18"},"Otros",{"$f":"NETWORKDAYS(LeaveTracker[[#This Row],[Fecha de inicio]],LeaveTracker[[#This Row],[Fecha de finalización]],lstHolidays)","v":2}]
[null,"Empleado 3",{"$f":"DATE(YEAR(TODAY()),1,18 )","v":"2017-01-18"},{"$f":"DATE(YEAR(TODAY()),1,21)","v":"2017-01-21"},"Otros",{"$f":"NETWORKDAYS(LeaveTracker[[#This Row],[Fecha de inicio]],LeaveTracker[[#This Row],[Fecha de finalización]],lstHolidays)","v":3}]
[null,"Empleado 5",{"$f":"DATE(YEAR(TODAY())-1,12,10 )","v":"2016-12-10"},{"$f":"DATE(YEAR(TODAY())-1,12,16)","v":"2016-12-16"},"Permiso por defunción",{"$f":"NETWORKDAYS(LeaveTracker[[#This Row],[Fecha de inicio]],LeaveTracker[[#This Row],[Fecha de finalización]],lstHolidays)","v":5}]
[null,"Empleado 4",{"$f":"DATE(YEAR(TODAY())-1,12,1  )","v":"2016-12-01"},{"$f":"DATE(YEAR(TODAY())-1,12,2)","v":"2016-12-02"},"Baja por enfermedad",{"$f":"NETWORKDAYS(LeaveTracker[[#This Row],[Fecha de inicio]],LeaveTracker[[#This Row],[Fecha de finalización]],lstHolidays)","v":2}]
[null,"Empleado 1",{"$f":"DATE(YEAR(TODAY())-1,11,14  )","v":"2016-11-14"},{"$f":"DATE(YEAR(TODAY())-1,11,18)","v":"2016-11-18"},"Vacaciones",{"$f":"NETWORKDAYS(LeaveTracker[[#This Row],[Fecha de inicio]],LeaveTracker[[#This Row],[Fecha de finalización]],lstHolidays)","v":5}]
[null,"Empleado 4",{"$f":"DATE(YEAR(TODAY()),1,31 )","v":"2017-01-31"},{"$f":"DATE(YEAR(TODAY()),2,4)","v":"2017-02-04"},"Baja por enfermedad",{"$f":"NETWORKDAYS(LeaveTracker[[#This Row],[Fecha de inicio]],LeaveTracker[[#This Row],[Fecha de finalización]],lstHolidays)","v":4}]
[null,"Empleado 4",{"$f":"DATE(YEAR(TODAY())-1,12,1  )","v":"2016-12-01"},{"$f":"DATE(YEAR(TODAY())-1,12,6)","v":"2016-12-06"},"Otros",{"$f":"NETWORKDAYS(LeaveTracker[[#This Row],[Fecha de inicio]],LeaveTracker[[#This Row],[Fecha de finalización]],lstHolidays)","v":4}]
[null,"Empleado 4",{"$f":"DATE(YEAR(TODAY())-1,12,10  )","v":"2016-12-10"},{"$f":"DATE(YEAR(TODAY())-1,12,16)","v":"2016-12-16"},"Otros",{"$f":"NETWORKDAYS(LeaveTracker[[#This Row],[Fecha de inicio]],LeaveTracker[[#This Row],[Fecha de finalización]],lstHolidays)","v":5}]
[null,"Empleado 2",{"$f":"DATE(YEAR(TODAY()),1,13 )","v":"2017-01-13"},{"$f":"DATE(YEAR(TODAY()),1,15)","v":"2017-01-15"},"Baja por enfermedad",{"$f":"NETWORKDAYS(LeaveTracker[[#This Row],[Fecha de inicio]],LeaveTracker[[#This Row],[Fecha de finalización]],lstHolidays)","v":1}]
[null,"Empleado 5",{"$f":"DATE(YEAR(TODAY()),1,15 )","v":"2017-01-15"},{"$f":"DATE(YEAR(TODAY()),1,20)","v":"2017-01-20"},"Baja por enfermedad",{"$f":"NETWORKDAYS(LeaveTracker[[#This Row],[Fecha de inicio]],LeaveTracker[[#This Row],[Fecha de finalización]],lstHolidays)","v":5}]
[null,"Empleado 2",{"$f":"DATE(YEAR(TODAY()),6,13 )","v":"2017-06-13"},{"$f":"DATE(YEAR(TODAY()),6,15)","v":"2017-06-15"},"Permiso por defunción",{"$f":"NETWORKDAYS(LeaveTracker[[#This Row],[Fecha de inicio]],LeaveTracker[[#This Row],[Fecha de finalización]],lstHolidays)","v":3}]
[null,"Empleado 5",{"$f":"DATE(YEAR(TODAY()),1,27 )","v":"2017-01-27"},{"$f":"DATE(YEAR(TODAY()),2,3)","v":"2017-02-03"},"Permiso por defunción",{"$f":"NETWORKDAYS(LeaveTracker[[#This Row],[Fecha de inicio]],LeaveTracker[[#This Row],[Fecha de finalización]],lstHolidays)","v":6}]
[null,"Empleado 3",{"$f":"DATE(YEAR(TODAY()),1,17 )","v":"2017-01-17"},{"$f":"DATE(YEAR(TODAY()),1,18)","v":"2017-01-18"},"Vacaciones",{"$f":"NETWORKDAYS(LeaveTracker[[#This Row],[Fecha de inicio]],LeaveTracker[[#This Row],[Fecha de finalización]],lstHolidays)","v":2}]
[null,"Empleado 3",{"$f":"DATE(YEAR(TODAY())-1,12,12 )","v":"2016-12-12"},{"$f":"DATE(YEAR(TODAY())-1,12,17)","v":"2016-12-17"},"Permiso por defunción",{"$f":"NETWORKDAYS(LeaveTracker[[#This Row],[Fecha de inicio]],LeaveTracker[[#This Row],[Fecha de finalización]],lstHolidays)","v":5}]
[null,"Empleado 1",{"$f":"DATE(YEAR(TODAY())-1,12,21  )","v":"2016-12-21"},{"$f":"DATE(YEAR(TODAY())-1,12,22)","v":"2016-12-22"},"Otros",{"$f":"NETWORKDAYS(LeaveTracker[[#This Row],[Fecha de inicio]],LeaveTracker[[#This Row],[Fecha de finalización]],lstHolidays)","v":2}]
[null,"Empleado 1",{"$f":"DATE(YEAR(TODAY())-1,12,14  )","v":"2016-12-14"},{"$f":"DATE(YEAR(TODAY())-1,12,16)","v":"2016-12-16"},"Vacaciones",{"$f":"NETWORKDAYS(LeaveTracker[[#This Row],[Fecha de inicio]],LeaveTracker[[#This Row],[Fecha de finalización]],lstHolidays)","v":3}]
[null,"Empleado 2",{"$f":"DATE(YEAR(TODAY())-1,11,29  )","v":"2016-11-29"},{"$f":"DATE(YEAR(TODAY())-1,12,6)","v":"2016-12-06"},"Permiso por defunción",{"$f":"NETWORKDAYS(LeaveTracker[[#This Row],[Fecha de inicio]],LeaveTracker[[#This Row],[Fecha de finalización]],lstHolidays)","v":6}]
[null,"Empleado 5",{"$f":"DATE(YEAR(TODAY())-1,12,3  )","v":"2016-12-03"},{"$f":"DATE(YEAR(TODAY())-1,12,7)","v":"2016-12-07"},"Vacaciones",{"$f":"NETWORKDAYS(LeaveTracker[[#This Row],[Fecha de inicio]],LeaveTracker[[#This Row],[Fecha de finalización]],lstHolidays)","v":3}]
[null,"Empleado 1",{"$f":"DATE(YEAR(TODAY()),1,31 )","v":"2017-01-31"},{"$f":"DATE(YEAR(TODAY()),2,2)","v":"2017-02-02"},"Permiso por defunción",{"$f":"NETWORKDAYS(LeaveTracker[[#This Row],[Fecha de inicio]],LeaveTracker[[#This Row],[Fecha de finalización]],lstHolidays)","v":3}]
[null,"Empleado 1",{"$f":"DATE(YEAR(TODAY())-1,11,24 )","v":"2016-11-24"},{"$f":"DATE(YEAR(TODAY())-1,11,29)","v":"2016-11-29"},"Baja por enfermedad",{"$f":"NETWORKDAYS(LeaveTracker[[#This Row],[Fecha de inicio]],LeaveTracker[[#This Row],[Fecha de finalización]],lstHolidays)","v":4}]
[null,"Empleado 2",{"$f":"DATE(YEAR(TODAY()),12,5 )","v":"2017-12-05"},{"$f":"DATE(YEAR(TODAY()),12,9)","v":"2017-12-09"},"Vacaciones",{"$f":"NETWORKDAYS(LeaveTracker[[#This Row],[Fecha de inicio]],LeaveTracker[[#This Row],[Fecha de finalización]],lstHolidays)","v":4}]
[null,"Empleado 5",{"$f":"DATE(YEAR(TODAY()),4,11 )","v":"2017-04-11"},{"$f":"DATE(YEAR(TODAY()),4,19)","v":"2017-04-19"},"Vacaciones",{"$f":"NETWORKDAYS(LeaveTracker[[#This Row],[Fecha de inicio]],LeaveTracker[[#This Row],[Fecha de finalización]],lstHolidays)","v":7}]

{"sheet":"Lista de empleados","index":2,"n_rows":8,"n_cols":2,"rows_kept":8,"cut":false,"hidden":false,"merged":[]}
[null,"Lista de empleados"]
[]
[null,"Nombres de los empleados"]
[null,"Empleado 1"]
[null,"Empleado 2"]
[null,"Empleado 3"]
[null,"Empleado 4"]
[null,"Empleado 5"]

{"sheet":"Tipos de baja","index":3,"n_rows":7,"n_cols":2,"rows_kept":7,"cut":false,"hidden":false,"merged":[]}
[null,"Tipos de baja"]
[]
[null,"Lista de tipos de baja"]
[null,"Baja por enfermedad"]
[null,"Vacaciones"]
[null,"Permiso por defunción"]
[null,"Otros"]

{"sheet":"Días festivos de la empresa","index":4,"n_rows":9,"n_cols":3,"rows_kept":9,"cut":false,"hidden":false,"merged":[]}
[null,"Días festivos de la empresa"]
[]
[null,"Días festivos de la empresa","Descripción"]
[null,{"$f":"DATE(YEAR(TODAY()),1,1)","v":"2017-01-01"},"Día de Año Nuevo"]
[null,{"$f":"DATE(YEAR(TODAY()),7,4)","v":"2017-07-04"},"Día de la Independencia"]
[null,{"$f":"DATE(YEAR(TODAY()),11,24)","v":"2017-11-24"},"Acción de Gracias"]
[null,{"$f":"DATE(YEAR(TODAY()),11,25)","v":"2017-11-25"},"Acción de Gracias"]
[null,{"$f":"DATE(YEAR(TODAY()),12,24)","v":"2017-12-24"},"Navidad"]
[null,{"$f":"DATE(YEAR(TODAY()),12,25)","v":"2017-12-25"},"Navidad"]